AnsweredAssumed Answered

bitbake过程中,电脑异常关机

Question asked by JUN C on Apr 25, 2019
Latest reply on Apr 25, 2019 by JUN C

大家好:

   今天遇上一件尴尬的事情,bitbake过程中,电脑蓝屏。

   再次开机执行Bitbake就一直报错。

   之前报错我都可以通过重新执行下列代码恢复

 

DISTRO=fsl-imx-xwayland MACHINE=imx8mqevk source fsl-setup-release.sh -b jun_build/

bitbake fsl-image-qt5-validation-imx

 

但是这次用这个方式好像恢复不了了,请教怎么处理这个问题,下面是报错信息:

 

jun@ubuntu:~/i.mx8/imx-yocto-bsp/jun_build$ bitbake fsl-image-qt5-validation-imxNOTE: Your conf/bblayers.conf has been automatically updated.
Loading cache: 100% |############################################| Time: 0:00:06
Loaded 3287 entries from dependency cache.
Parsing recipes: 100% |##########################################| Time: 0:00:04
Parsing of 2440 .bb files complete (2438 cached, 2 parsed). 3289 targets, 406 skipped, 9 masked, 0 errors.
NOTE: Resolving any missing task queue dependencies

Build Configuration:
BB_VERSION = "1.36.0"
BUILD_SYS = "x86_64-linux"
NATIVELSBSTRING = "ubuntu-16.04"
TARGET_SYS = "aarch64-poky-linux"
MACHINE = "imx8mqevk"
DISTRO = "fsl-imx-wayland"
DISTRO_VERSION = "4.9.88-2.1.0_8mm_alpha"
TUNE_FEATURES = "aarch64"
TARGET_FPU = ""
meta
meta-poky = "my_imx_bsp:fdeecc901196bbccd7c5b1ea4268a2cf56764a62"
meta-oe
meta-multimedia = "my_imx_bsp:dacfa2b1920e285531bec55cd2f08743390aaf57"
meta-freescale = "my_imx_bsp:49ac225a38f6d84519798e3264f2e4d19b84f70a"
meta-freescale-3rdparty = "my_imx_bsp:62de01743c9233ea718de22991c47b73a78b4857"
meta-freescale-distro = "my_imx_bsp:0ec6d7e206705702b5b534611754de0787f92b72"
meta-bsp
meta-sdk = "my_imx_bsp:8898f51c96e0e79dd56690d797d309f013ec9f76"
meta-browser = "my_imx_bsp:d6f9aed41c73b75a97d71bff060b03a66ee087b1"
meta-gnome
meta-networking
meta-python
meta-filesystems = "my_imx_bsp:dacfa2b1920e285531bec55cd2f08743390aaf57"
meta-qt5 = "my_imx_bsp:cfe02f26de53e5c20e6f9555059cbaaf5ab9b22f"

Initialising tasks: 100% |#######################################| Time: 0:00:33
NOTE: Executing SetScene Tasks
NOTE: Executing RunQueue Tasks
ERROR: qtdeclarative-5.9.5+gitAUTOINC+f23d1d54a0-r0 do_compile_ptest_base: oe_runmake failed
ERROR: qtdeclarative-5.9.5+gitAUTOINC+f23d1d54a0-r0 do_compile_ptest_base: Function failed: do_compile_ptest_base (log file is located at /home/jun/i.mx8/imx-yocto-bsp/jun_build/tmp/work/aarch64-poky-linux/qtdeclarative/5.9.5+gitAUTOINC+f23d1d54a0-r0/temp/log.do_compile_ptest_base.10069)
ERROR: Logfile of failure stored in: /home/jun/i.mx8/imx-yocto-bsp/jun_build/tmp/work/aarch64-poky-linux/qtdeclarative/5.9.5+gitAUTOINC+f23d1d54a0-r0/temp/log.do_compile_ptest_base.10069
Log data follows:
| DEBUG: Executing shell function do_compile_ptest_base
| NOTE: make MAKEFLAGS=-j 1 OE_QMAKE_COMPILER=aarch64-poky-linux-gcc --sysroot=/home/jun/i.mx8/imx-yocto-bsp/jun_build/tmp/work/aarch64-poky-linux/qtdeclarative/5.9.5+gitAUTOINC+f23d1d54a0-r0/recipe-sysroot OE_QMAKE_CC=aarch64-poky-linux-gcc --sysroot=/home/jun/i.mx8/imx-yocto-bsp/jun_build/tmp/work/aarch64-poky-linux/qtdeclarative/5.9.5+gitAUTOINC+f23d1d54a0-r0/recipe-sysroot OE_QMAKE_CXX=aarch64-poky-linux-g++ --sysroot=/home/jun/i.mx8/imx-yocto-bsp/jun_build/tmp/work/aarch64-poky-linux/qtdeclarative/5.9.5+gitAUTOINC+f23d1d54a0-r0/recipe-sysroot OE_QMAKE_CFLAGS= -O2 -pipe -g -feliminate-unused-debug-types -fdebug-prefix-map=/home/jun/i.mx8/imx-yocto-bsp/jun_build/tmp/work/aarch64-poky-linux/qtdeclarative/5.9.5+gitAUTOINC+f23d1d54a0-r0=/usr/src/debug/qtdeclarative/5.9.5+gitAUTOINC+f23d1d54a0-r0 -fdebug-prefix-map=/home/jun/i.mx8/imx-yocto-bsp/jun_build/tmp/work/aarch64-poky-linux/qtdeclarative/5.9.5+gitAUTOINC+f23d1d54a0-r0/recipe-sysroot-native= -fdebug-prefix-map=/home/jun/i.mx8/imx-yocto-bsp/jun_build/tmp/work/aarch64-poky-linux/qtdeclarative/5.9.5+gitAUTOINC+f23d1d54a0-r0/recipe-sysroot= OE_QMAKE_CXXFLAGS= -O2 -pipe -g -feliminate-unused-debug-types -fdebug-prefix-map=/home/jun/i.mx8/imx-yocto-bsp/jun_build/tmp/work/aarch64-poky-linux/qtdeclarative/5.9.5+gitAUTOINC+f23d1d54a0-r0=/usr/src/debug/qtdeclarative/5.9.5+gitAUTOINC+f23d1d54a0-r0 -fdebug-prefix-map=/home/jun/i.mx8/imx-yocto-bsp/jun_build/tmp/work/aarch64-poky-linux/qtdeclarative/5.9.5+gitAUTOINC+f23d1d54a0-r0/recipe-sysroot-native= -fdebug-prefix-map=/home/jun/i.mx8/imx-yocto-bsp/jun_build/tmp/work/aarch64-poky-linux/qtdeclarative/5.9.5+gitAUTOINC+f23d1d54a0-r0/recipe-sysroot= -fvisibility-inlines-hidden OE_QMAKE_LINK=aarch64-poky-linux-g++ --sysroot=/home/jun/i.mx8/imx-yocto-bsp/jun_build/tmp/work/aarch64-poky-linux/qtdeclarative/5.9.5+gitAUTOINC+f23d1d54a0-r0/recipe-sysroot OE_QMAKE_LDFLAGS=-Wl,-O1 -Wl,--hash-style=gnu -Wl,--as-needed OE_QMAKE_AR=aarch64-poky-linux-ar OE_QMAKE_STRIP=echo OE_QMAKE_WAYLAND_SCANNER=/home/jun/i.mx8/imx-yocto-bsp/jun_build/tmp/work/aarch64-poky-linux/qtdeclarative/5.9.5+gitAUTOINC+f23d1d54a0-r0/recipe-sysroot-native/usr/bin/wayland-scanner OE_QMAKE_INCDIR_QT=/home/jun/i.mx8/imx-yocto-bsp/jun_build/tmp/work/aarch64-poky-linux/qtdeclarative/5.9.5+gitAUTOINC+f23d1d54a0-r0/recipe-sysroot//usr/include/qt5
| cd auto/ && ( test -e Makefile || /home/jun/i.mx8/imx-yocto-bsp/jun_build/tmp/work/aarch64-poky-linux/qtdeclarative/5.9.5+gitAUTOINC+f23d1d54a0-r0/recipe-sysroot-native/usr/bin/qt5/qmake -o Makefile /home/jun/i.mx8/imx-yocto-bsp/jun_build/tmp/work/aarch64-poky-linux/qtdeclarative/5.9.5+gitAUTOINC+f23d1d54a0-r0/git/tests/auto/auto.pro ) && make -f Makefile
| make[1]: Entering directory '/home/jun/i.mx8/imx-yocto-bsp/jun_build/tmp/work/aarch64-poky-linux/qtdeclarative/5.9.5+gitAUTOINC+f23d1d54a0-r0/git/tests/auto'
| cd qml/ && ( test -e Makefile || /home/jun/i.mx8/imx-yocto-bsp/jun_build/tmp/work/aarch64-poky-linux/qtdeclarative/5.9.5+gitAUTOINC+f23d1d54a0-r0/recipe-sysroot-native/usr/bin/qt5/qmake -o Makefile /home/jun/i.mx8/imx-yocto-bsp/jun_build/tmp/work/aarch64-poky-linux/qtdeclarative/5.9.5+gitAUTOINC+f23d1d54a0-r0/git/tests/auto/qml/qml.pro ) && make -f Makefile
| make[2]: Entering directory '/home/jun/i.mx8/imx-yocto-bsp/jun_build/tmp/work/aarch64-poky-linux/qtdeclarative/5.9.5+gitAUTOINC+f23d1d54a0-r0/git/tests/auto/qml'
| cd parserstress/ && ( test -e Makefile || /home/jun/i.mx8/imx-yocto-bsp/jun_build/tmp/work/aarch64-poky-linux/qtdeclarative/5.9.5+gitAUTOINC+f23d1d54a0-r0/recipe-sysroot-native/usr/bin/qt5/qmake -o Makefile /home/jun/i.mx8/imx-yocto-bsp/jun_build/tmp/work/aarch64-poky-linux/qtdeclarative/5.9.5+gitAUTOINC+f23d1d54a0-r0/git/tests/auto/qml/parserstress/parserstress.pro ) && make -f Makefile
| make[3]: Entering directory '/home/jun/i.mx8/imx-yocto-bsp/jun_build/tmp/work/aarch64-poky-linux/qtdeclarative/5.9.5+gitAUTOINC+f23d1d54a0-r0/git/tests/auto/qml/parserstress'
| make[3]: Nothing to be done for 'first'.
| make[3]: Leaving directory '/home/jun/i.mx8/imx-yocto-bsp/jun_build/tmp/work/aarch64-poky-linux/qtdeclarative/5.9.5+gitAUTOINC+f23d1d54a0-r0/git/tests/auto/qml/parserstress'
| cd qjsvalueiterator/ && ( test -e Makefile || /home/jun/i.mx8/imx-yocto-bsp/jun_build/tmp/work/aarch64-poky-linux/qtdeclarative/5.9.5+gitAUTOINC+f23d1d54a0-r0/recipe-sysroot-native/usr/bin/qt5/qmake -o Makefile /home/jun/i.mx8/imx-yocto-bsp/jun_build/tmp/work/aarch64-poky-linux/qtdeclarative/5.9.5+gitAUTOINC+f23d1d54a0-r0/git/tests/auto/qml/qjsvalueiterator/qjsvalueiterator.pro ) && make -f Makefile
| make[3]: Entering directory '/home/jun/i.mx8/imx-yocto-bsp/jun_build/tmp/work/aarch64-poky-linux/qtdeclarative/5.9.5+gitAUTOINC+f23d1d54a0-r0/git/tests/auto/qml/qjsvalueiterator'
| make[3]: Nothing to be done for 'first'.
| make[3]: Leaving directory '/home/jun/i.mx8/imx-yocto-bsp/jun_build/tmp/work/aarch64-poky-linux/qtdeclarative/5.9.5+gitAUTOINC+f23d1d54a0-r0/git/tests/auto/qml/qjsvalueiterator'
| cd qjsonbinding/ && ( test -e Makefile || /home/jun/i.mx8/imx-yocto-bsp/jun_build/tmp/work/aarch64-poky-linux/qtdeclarative/5.9.5+gitAUTOINC+f23d1d54a0-r0/recipe-sysroot-native/usr/bin/qt5/qmake -o Makefile /home/jun/i.mx8/imx-yocto-bsp/jun_build/tmp/work/aarch64-poky-linux/qtdeclarative/5.9.5+gitAUTOINC+f23d1d54a0-r0/git/tests/auto/qml/qjsonbinding/qjsonbinding.pro ) && make -f Makefile
| make[3]: Entering directory '/home/jun/i.mx8/imx-yocto-bsp/jun_build/tmp/work/aarch64-poky-linux/qtdeclarative/5.9.5+gitAUTOINC+f23d1d54a0-r0/git/tests/auto/qml/qjsonbinding'
| make[3]: Nothing to be done for 'first'.
| make[3]: Leaving directory '/home/jun/i.mx8/imx-yocto-bsp/jun_build/tmp/work/aarch64-poky-linux/qtdeclarative/5.9.5+gitAUTOINC+f23d1d54a0-r0/git/tests/auto/qml/qjsonbinding'
| cd qqmlfile/ && ( test -e Makefile || /home/jun/i.mx8/imx-yocto-bsp/jun_build/tmp/work/aarch64-poky-linux/qtdeclarative/5.9.5+gitAUTOINC+f23d1d54a0-r0/recipe-sysroot-native/usr/bin/qt5/qmake -o Makefile /home/jun/i.mx8/imx-yocto-bsp/jun_build/tmp/work/aarch64-poky-linux/qtdeclarative/5.9.5+gitAUTOINC+f23d1d54a0-r0/git/tests/auto/qml/qqmlfile/qqmlfile.pro ) && make -f Makefile
| make[3]: Entering directory '/home/jun/i.mx8/imx-yocto-bsp/jun_build/tmp/work/aarch64-poky-linux/qtdeclarative/5.9.5+gitAUTOINC+f23d1d54a0-r0/git/tests/auto/qml/qqmlfile'
| make[3]: Nothing to be done for 'first'.
| make[3]: Leaving directory '/home/jun/i.mx8/imx-yocto-bsp/jun_build/tmp/work/aarch64-poky-linux/qtdeclarative/5.9.5+gitAUTOINC+f23d1d54a0-r0/git/tests/auto/qml/qqmlfile'
| cd qqmlfileselector/ && ( test -e Makefile || /home/jun/i.mx8/imx-yocto-bsp/jun_build/tmp/work/aarch64-poky-linux/qtdeclarative/5.9.5+gitAUTOINC+f23d1d54a0-r0/recipe-sysroot-native/usr/bin/qt5/qmake -o Makefile /home/jun/i.mx8/imx-yocto-bsp/jun_build/tmp/work/aarch64-poky-linux/qtdeclarative/5.9.5+gitAUTOINC+f23d1d54a0-r0/git/tests/auto/qml/qqmlfileselector/qqmlfileselector.pro ) && make -f Makefile
| make[3]: Entering directory '/home/jun/i.mx8/imx-yocto-bsp/jun_build/tmp/work/aarch64-poky-linux/qtdeclarative/5.9.5+gitAUTOINC+f23d1d54a0-r0/git/tests/auto/qml/qqmlfileselector'
| make[3]: Nothing to be done for 'first'.
| make[3]: Leaving directory '/home/jun/i.mx8/imx-yocto-bsp/jun_build/tmp/work/aarch64-poky-linux/qtdeclarative/5.9.5+gitAUTOINC+f23d1d54a0-r0/git/tests/auto/qml/qqmlfileselector'
| cd qmlmin/ && ( test -e Makefile || /home/jun/i.mx8/imx-yocto-bsp/jun_build/tmp/work/aarch64-poky-linux/qtdeclarative/5.9.5+gitAUTOINC+f23d1d54a0-r0/recipe-sysroot-native/usr/bin/qt5/qmake -o Makefile /home/jun/i.mx8/imx-yocto-bsp/jun_build/tmp/work/aarch64-poky-linux/qtdeclarative/5.9.5+gitAUTOINC+f23d1d54a0-r0/git/tests/auto/qml/qmlmin/qmlmin.pro ) && make -f Makefile
| make[3]: Entering directory '/home/jun/i.mx8/imx-yocto-bsp/jun_build/tmp/work/aarch64-poky-linux/qtdeclarative/5.9.5+gitAUTOINC+f23d1d54a0-r0/git/tests/auto/qml/qmlmin'
| make[3]: Nothing to be done for 'first'.
| make[3]: Leaving directory '/home/jun/i.mx8/imx-yocto-bsp/jun_build/tmp/work/aarch64-poky-linux/qtdeclarative/5.9.5+gitAUTOINC+f23d1d54a0-r0/git/tests/auto/qml/qmlmin'
| cd qqmlcomponent/ && ( test -e Makefile || /home/jun/i.mx8/imx-yocto-bsp/jun_build/tmp/work/aarch64-poky-linux/qtdeclarative/5.9.5+gitAUTOINC+f23d1d54a0-r0/recipe-sysroot-native/usr/bin/qt5/qmake -o Makefile /home/jun/i.mx8/imx-yocto-bsp/jun_build/tmp/work/aarch64-poky-linux/qtdeclarative/5.9.5+gitAUTOINC+f23d1d54a0-r0/git/tests/auto/qml/qqmlcomponent/qqmlcomponent.pro ) && make -f Makefile
| make[3]: Entering directory '/home/jun/i.mx8/imx-yocto-bsp/jun_build/tmp/work/aarch64-poky-linux/qtdeclarative/5.9.5+gitAUTOINC+f23d1d54a0-r0/git/tests/auto/qml/qqmlcomponent'
| make[3]: Nothing to be done for 'first'.
| make[3]: Leaving directory '/home/jun/i.mx8/imx-yocto-bsp/jun_build/tmp/work/aarch64-poky-linux/qtdeclarative/5.9.5+gitAUTOINC+f23d1d54a0-r0/git/tests/auto/qml/qqmlcomponent'
| cd qqmlconsole/ && ( test -e Makefile || /home/jun/i.mx8/imx-yocto-bsp/jun_build/tmp/work/aarch64-poky-linux/qtdeclarative/5.9.5+gitAUTOINC+f23d1d54a0-r0/recipe-sysroot-native/usr/bin/qt5/qmake -o Makefile /home/jun/i.mx8/imx-yocto-bsp/jun_build/tmp/work/aarch64-poky-linux/qtdeclarative/5.9.5+gitAUTOINC+f23d1d54a0-r0/git/tests/auto/qml/qqmlconsole/qqmlconsole.pro ) && make -f Makefile
| make[3]: Entering directory '/home/jun/i.mx8/imx-yocto-bsp/jun_build/tmp/work/aarch64-poky-linux/qtdeclarative/5.9.5+gitAUTOINC+f23d1d54a0-r0/git/tests/auto/qml/qqmlconsole'
| make[3]: Nothing to be done for 'first'.
| make[3]: Leaving directory '/home/jun/i.mx8/imx-yocto-bsp/jun_build/tmp/work/aarch64-poky-linux/qtdeclarative/5.9.5+gitAUTOINC+f23d1d54a0-r0/git/tests/auto/qml/qqmlconsole'
| cd qqmlengine/ && ( test -e Makefile || /home/jun/i.mx8/imx-yocto-bsp/jun_build/tmp/work/aarch64-poky-linux/qtdeclarative/5.9.5+gitAUTOINC+f23d1d54a0-r0/recipe-sysroot-native/usr/bin/qt5/qmake -o Makefile /home/jun/i.mx8/imx-yocto-bsp/jun_build/tmp/work/aarch64-poky-linux/qtdeclarative/5.9.5+gitAUTOINC+f23d1d54a0-r0/git/tests/auto/qml/qqmlengine/qqmlengine.pro ) && make -f Makefile
| make[3]: Entering directory '/home/jun/i.mx8/imx-yocto-bsp/jun_build/tmp/work/aarch64-poky-linux/qtdeclarative/5.9.5+gitAUTOINC+f23d1d54a0-r0/git/tests/auto/qml/qqmlengine'
| make[3]: Nothing to be done for 'first'.
| make[3]: Leaving directory '/home/jun/i.mx8/imx-yocto-bsp/jun_build/tmp/work/aarch64-poky-linux/qtdeclarative/5.9.5+gitAUTOINC+f23d1d54a0-r0/git/tests/auto/qml/qqmlengine'
| cd qqmlerror/ && ( test -e Makefile || /home/jun/i.mx8/imx-yocto-bsp/jun_build/tmp/work/aarch64-poky-linux/qtdeclarative/5.9.5+gitAUTOINC+f23d1d54a0-r0/recipe-sysroot-native/usr/bin/qt5/qmake -o Makefile /home/jun/i.mx8/imx-yocto-bsp/jun_build/tmp/work/aarch64-poky-linux/qtdeclarative/5.9.5+gitAUTOINC+f23d1d54a0-r0/git/tests/auto/qml/qqmlerror/qqmlerror.pro ) && make -f Makefile
| make[3]: Entering directory '/home/jun/i.mx8/imx-yocto-bsp/jun_build/tmp/work/aarch64-poky-linux/qtdeclarative/5.9.5+gitAUTOINC+f23d1d54a0-r0/git/tests/auto/qml/qqmlerror'
| make[3]: Nothing to be done for 'first'.
| make[3]: Leaving directory '/home/jun/i.mx8/imx-yocto-bsp/jun_build/tmp/work/aarch64-poky-linux/qtdeclarative/5.9.5+gitAUTOINC+f23d1d54a0-r0/git/tests/auto/qml/qqmlerror'
| cd qqmlincubator/ && ( test -e Makefile || /home/jun/i.mx8/imx-yocto-bsp/jun_build/tmp/work/aarch64-poky-linux/qtdeclarative/5.9.5+gitAUTOINC+f23d1d54a0-r0/recipe-sysroot-native/usr/bin/qt5/qmake -o Makefile /home/jun/i.mx8/imx-yocto-bsp/jun_build/tmp/work/aarch64-poky-linux/qtdeclarative/5.9.5+gitAUTOINC+f23d1d54a0-r0/git/tests/auto/qml/qqmlincubator/qqmlincubator.pro ) && make -f Makefile
| make[3]: Entering directory '/home/jun/i.mx8/imx-yocto-bsp/jun_build/tmp/work/aarch64-poky-linux/qtdeclarative/5.9.5+gitAUTOINC+f23d1d54a0-r0/git/tests/auto/qml/qqmlincubator'
| make[3]: Nothing to be done for 'first'.
| make[3]: Leaving directory '/home/jun/i.mx8/imx-yocto-bsp/jun_build/tmp/work/aarch64-poky-linux/qtdeclarative/5.9.5+gitAUTOINC+f23d1d54a0-r0/git/tests/auto/qml/qqmlincubator'
| cd qqmlinfo/ && ( test -e Makefile || /home/jun/i.mx8/imx-yocto-bsp/jun_build/tmp/work/aarch64-poky-linux/qtdeclarative/5.9.5+gitAUTOINC+f23d1d54a0-r0/recipe-sysroot-native/usr/bin/qt5/qmake -o Makefile /home/jun/i.mx8/imx-yocto-bsp/jun_build/tmp/work/aarch64-poky-linux/qtdeclarative/5.9.5+gitAUTOINC+f23d1d54a0-r0/git/tests/auto/qml/qqmlinfo/qqmlinfo.pro ) && make -f Makefile
| make[3]: Entering directory '/home/jun/i.mx8/imx-yocto-bsp/jun_build/tmp/work/aarch64-poky-linux/qtdeclarative/5.9.5+gitAUTOINC+f23d1d54a0-r0/git/tests/auto/qml/qqmlinfo'
| make[3]: Nothing to be done for 'first'.
| make[3]: Leaving directory '/home/jun/i.mx8/imx-yocto-bsp/jun_build/tmp/work/aarch64-poky-linux/qtdeclarative/5.9.5+gitAUTOINC+f23d1d54a0-r0/git/tests/auto/qml/qqmlinfo'
| cd qqmllistreference/ && ( test -e Makefile || /home/jun/i.mx8/imx-yocto-bsp/jun_build/tmp/work/aarch64-poky-linux/qtdeclarative/5.9.5+gitAUTOINC+f23d1d54a0-r0/recipe-sysroot-native/usr/bin/qt5/qmake -o Makefile /home/jun/i.mx8/imx-yocto-bsp/jun_build/tmp/work/aarch64-poky-linux/qtdeclarative/5.9.5+gitAUTOINC+f23d1d54a0-r0/git/tests/auto/qml/qqmllistreference/qqmllistreference.pro ) && make -f Makefile
| make[3]: Entering directory '/home/jun/i.mx8/imx-yocto-bsp/jun_build/tmp/work/aarch64-poky-linux/qtdeclarative/5.9.5+gitAUTOINC+f23d1d54a0-r0/git/tests/auto/qml/qqmllistreference'
| make[3]: *** No targets. Stop.
| make[3]: Leaving directory '/home/jun/i.mx8/imx-yocto-bsp/jun_build/tmp/work/aarch64-poky-linux/qtdeclarative/5.9.5+gitAUTOINC+f23d1d54a0-r0/git/tests/auto/qml/qqmllistreference'
| ERROR: oe_runmake failed
| Makefile:374: recipe for target 'sub-qqmllistreference-make_first' failed
| make[2]: *** [sub-qqmllistreference-make_first] Error 2
| make[2]: Leaving directory '/home/jun/i.mx8/imx-yocto-bsp/jun_build/tmp/work/aarch64-poky-linux/qtdeclarative/5.9.5+gitAUTOINC+f23d1d54a0-r0/git/tests/auto/qml'
| Makefile:53: recipe for target 'sub-qml-make_first' failed
| make[1]: *** [sub-qml-make_first] Error 2
| make[1]: Leaving directory '/home/jun/i.mx8/imx-yocto-bsp/jun_build/tmp/work/aarch64-poky-linux/qtdeclarative/5.9.5+gitAUTOINC+f23d1d54a0-r0/git/tests/auto'
| Makefile:45: recipe for target 'sub-auto-make_first' failed
| make: *** [sub-auto-make_first] Error 2
| WARNING: exit code 1 from a shell command.
| ERROR: Function failed: do_compile_ptest_base (log file is located at /home/jun/i.mx8/imx-yocto-bsp/jun_build/tmp/work/aarch64-poky-linux/qtdeclarative/5.9.5+gitAUTOINC+f23d1d54a0-r0/temp/log.do_compile_ptest_base.10069)
ERROR: Task (/home/jun/i.mx8/imx-yocto-bsp/sources/meta-qt5/recipes-qt/qt5/qtdeclarative_git.bb:do_compile_ptest_base) failed with exit code '1'
NOTE: Tasks Summary: Attempted 1923 tasks of which 1922 didn't need to be rerun and 1 failed.

Summary: 1 task failed:
/home/jun/i.mx8/imx-yocto-bsp/sources/meta-qt5/recipes-qt/qt5/qtdeclarative_git.bb:do_compile_ptest_base
Summary: There were 2 ERROR messages shown, returning a non-zero exit code.

Outcomes